government
type: Concept
narrower: tailhook scandal

concepts
type: Collection
type: ConceptGroup
member: tailhook scandal

tailhook scandal
type: Concept
definition: an incident involving U.S. Navy personnel in which male officers assaulted 26 women (including other Navy personnel) at a convention of the Tailhook Association in Las Vegas in 1992. Although the officers' behavior was cast as sexual harassment, it easily could have been charged as sexual assault. [Source: The Concise Dictionary of Crime and Justice; Tailhook Scandal]
broader: government