culture and politics
type: Concept
narrower: talk radio

talk radio
type: Concept
definition: Political talk radio—programs that emphasize political events, issues, policies, and public affairs—has been a feature of American politics since the 1930s. President Franklin Roosevelt used radio to address the public during economic depression and world war, while Father Charles Coughlin provided an opposing voice. [Source: The Encyclopedia of Political Science; Talk Radio]
broader: culture and politics

concepts
type: Collection
type: ConceptGroup
member: talk radio