tattooing
type: Concept
definition: tattoo-like alterations to human skin caused by grains of gunpowder being driven into the skin. The presence of tattooing can reveal the distance between a shooter and the person shot. [Source: The Concise Dictionary of Crime and Justice; Tattooing]
broader: prison life

prison life
type: Concept
narrower: tattooing

concepts
type: Collection
type: ConceptGroup
member: tattooing