technology in the classroom
type: Concept
definition: Technology in the classroom could theoretically be traced back to the emergence of early tools, (e.g., chalk and tablets). However, technology use in the classroom usually starts with educational film in the early 20th century. [Source: Sociology of Education: An A-to-Z Guide; Technology in the Classroom]
broader: school systems, structures, and processes

school systems, structures, and processes
type: Concept
narrower: technology in the classroom

concepts
type: Collection
type: ConceptGroup
member: technology in the classroom