educational process: societal perspectives
type: Concept
narrower: technology integration

technology integration
type: Concept
definition: The process of using different technological tools to increase the quality of teaching and learning in instructional contexts. As technology evolves, it affects every dimension of society; the processes and the tools of education have also been affected by technological innovations. [Source: The SAGE Glossary of the Social and Behavioral Sciences; Technology Integration]
broader: educational process: societal perspectives

concepts
type: Collection
type: ConceptGroup
member: technology integration