economic sectors
type: Concept
narrower: technology sector

technology sector
type: Concept
definition: The application of technology is a distinguishing feature of modern capitalism and thus a universal subject in all disciplines, including global studies. Control over science and scientific activity through incessant technological change enabled the capitalist system to overcome its most significant barrier: the limitation of the working day. [Source: Encyclopedia of Global Studies; Technology Sector]
broader: economic sectors

concepts
type: Collection
type: ConceptGroup
member: technology sector