terrorism and work
type: Concept
definition: On September 11, 2001, in the largest terrorist attack in history, four passenger planes were commandeered by terrorists and flown into the office buildings of the World Trade Center Twin Towers and the Pentagon, killing an estimated 3,000 people and injuring another 250. This tragic event was an extreme example of the many acts of terrorism that have been targeted at workplaces. [Source: Encyclopedia of Industrial and Organizational Psychology; Terrorism and Work]
broader: organizational structure, design, and change

organizational structure, design, and change
type: Concept
narrower: terrorism and work

concepts
type: Collection
type: ConceptGroup
member: terrorism and work