theory construction
type: Concept
definition: Theory construction is the process of developing theories in accord with criteria for their production and analysis. A number of texts offer methods for constructing sociological theories; however, at the present time, the field of sociology has no widely agreed-upon set of criteria for building and evaluating theories.This entry presents criteria for theory construction and theory analysis that are consistent with some of the sociological prescriptions and, more important, with criteria that are widely accepted in other sciences. [Source: Encyclopedia of Social Theory; Theory Construction]
broader: method and metatheory

method and metatheory
type: Concept
narrower: theory construction

methods
type: Collection
type: ConceptGroup
member: theory construction