subdisciplines
type: Concept
narrower: trait-factor counseling

trait-factor counseling
type: Concept
definition: Trait-factor counseling approaches assume that career choice may be facilitated and career outcomes optimized through a fairly straightforward process of matching an individual's most relevant work-relevant characteristics (abilities, interests, values, etc.) with information regarding job activities, demands, rewards, and availability. The counseling process for this approach typically starts with a client interview, then proceeds to extensive psychometric assessment of the client's work-relevant characteristics, and is finalized with an interpretation of assessment results with connections being drawn between these results and one or more occupational classification systems. [Source: Encyclopedia of Counseling; Trait-Factor Counseling]
broader: subdisciplines

concepts
type: Collection
type: ConceptGroup
member: trait-factor counseling