transitology
type: Concept
definition: Transitology is the study of the systemic change process from authoritarian regimes to democracies or to postauthoritarian regimes. Since the late 1970s, after the wave of political transitions swept Greece, Spain, and Portugal and similar changes subsequently occurred in South America, ambitious transitology literature on Latin America and southern Europe focused on generic scenarios of regime change in these two areas. [Source: The Encyclopedia of Political Science; Transitology]
broader: comparative politics

comparative politics
type: Concept
narrower: transitology

concepts
type: Collection
type: ConceptGroup
member: transitology