trusteeship system
type: Concept
definition: The trusteeship system was a direct continuation of the previously mandated system, developed under the authority of the League of Nations. Under this system, the formerly mandated countries continued to assist the mandated territories in building their capacity to support statehood and sovereignty. [Source: The Encyclopedia of Political Science; Trusteeship System]
broader: international relations

international relations
type: Concept
narrower: trusteeship system

concepts
type: Collection
type: ConceptGroup
member: trusteeship system