unanticipated outcome disclosure
type: Concept
definition: An unanticipated outcome is a result that differs significantly from what was anticipated to be the result from a treatment or procedure. Every treatment and procedure carries with it anticipated and unanticipated consequences. [Source: Encyclopedia of Health Care Management; Unanticipated Outcome Disclosure]
broader: legal and regulatory issues

legal and regulatory issues
type: Concept
narrower: unanticipated outcome disclosure

concepts
type: Collection
type: ConceptGroup
member: unanticipated outcome disclosure