underground media
type: Concept
definition: Underground media is synonymous with underground press and underground journalism. All these terms refer to the ideologically liberal journalism during the 1960s and 1970s that revolted against the journalistic norms of objectivity and appeared in the form of independently owned, published, and distributed print media. [Source: Encyclopedia of Political Communication; Underground Media]
broader: media

media
type: Concept
narrower: underground media

concepts
type: Collection
type: ConceptGroup
member: underground media