teachers/counselors in society
type: Concept
narrower: underqualified teachers

underqualified teachers
type: Concept
definition: Underqualified teachers are defined as those not meeting state licensure standards and subject matter expertise. In measuring a teacher's quality, degrees and certification are used as the primary indicators of credentials. [Source: Sociology of Education: An A-to-Z Guide; Underqualified Teachers]
broader: teachers/counselors in society

concepts
type: Collection
type: ConceptGroup
member: underqualified teachers