universals in art
type: Concept
definition: From a strict anthropological point of view, informed by the recent self-critical turn of the research, it is a debatable issue whether we should admit universals in art. It is equally an open question as to whether art is indeed a universal form of expression and communication. [Source: Encyclopedia of Anthropology; Art, Universals in]
broader: research/theoretical frameworks

research/theoretical frameworks
type: Concept
narrower: universals in art

concepts
type: Collection
type: ConceptGroup
member: universals in art