abandonment
type: Concept
narrower: vacancy rate

concepts
type: Collection
type: ConceptGroup
member: vacancy rate

vacancy rate
type: Concept
definition: The vacancy rate is an important concept in market analysis for all residential and nonresidential (e.g., retail, office, warehouse) real property types. This discussion focuses on residential markets, especially the apartment market, but it is also applicable to the nonresidential markets. [Source: The Encyclopedia of Housing; Vacancy Rate]
broader: abandonment