verbal communication processes
type: Concept
definition: Communication is integral to human relationships. Researchers who study verbal communication processes often view them as patterns of interconnections or as relational states, whether they occur between two people or between an individual and a larger audience. [Source: Encyclopedia of Human Relationships; Communication Processes, Verbal]
broader: communication processes

communication processes
type: Concept
narrower: verbal communication processes

concepts
type: Collection
type: ConceptGroup
member: verbal communication processes