video games
type: Concept
alternative label: electronic games
alternative label: computer games
definition: Video games often provide the first opportunity for children to interact with computer technology. However, the study of the impact on children's behavior of video games is fraught with controversy. [Source: Encyclopedia of Applied Developmental Science; Video Games]
broader: play and playthings

play and playthings
type: Concept
narrower: video games

concepts
type: Collection
type: ConceptGroup
member: video games