geographic information systems
type: Concept
narrower: virtual and immersive environments

concepts
type: Collection
type: ConceptGroup
member: virtual and immersive environments

virtual and immersive environments
type: Concept
definition: A virtual environment is a setting that is not real but includes real traits with which people can identify. The contents may reflect pure imagination or may model the real world. [Source: Encyclopedia of Geography; Virtual and Immersive Environments]
broader: geographic information systems