virtual state
type: Concept
definition: A virtual state is a country unit that, like a virtual corporation, has largely transferred its production overseas. This occurs for two reasons. [Source: International Encyclopedia of Political Science; State, Virtual]
broader: comparative politics

comparative politics
type: Concept
narrower: virtual state

concepts
type: Collection
type: ConceptGroup
member: virtual state