vitiligo
type: Concept
definition: Vitiligo is a condition in which the skin loses melanocytes (skin cells that produce pigment). This results in lighter than normal patches of skin. [Source: Encyclopedia of Global Health; Vitiligo]
broader: localized diseases

localized diseases
type: Concept
narrower: vitiligo

concepts
type: Collection
type: ConceptGroup
member: vitiligo