vodou
type: Concept
definition: Vodou is Haiti's national religion and incorporates elements from traditional African religion with Christian images and practices. The term voodoo is a creation of the European American imaginary and should be rejected as it has been misconstrued to designate irrational, baseless, and unfounded myths about Vodou practices. [Source: Encyclopedia of Global Religion; Vodou]
broader: religious traditions and groups

religious traditions and groups
type: Concept
narrower: vodou

concepts
type: Collection
type: ConceptGroup
member: vodou