eyewitness memory
type: Concept
narrower: voice recognition

concepts
type: Collection
type: ConceptGroup
member: voice recognition

voice recognition
type: Concept
definition: Voice recognition, or “earwitness” identification, has not received the amount of research or public interest that eyewitness identification has received in recent years. A 1983 survey of British legal cases, however, found more than 180 cases at that time in which voice identifications were used as evidence. [Source: Encyclopedia of Psychology and Law; Voice Recognition]
broader: eyewitness memory