methods
type: Collection
type: ConceptGroup
member: voice stress analysis

voice stress analysis
type: Concept
definition: an electronic means of analyzing voice patterns to detect deception. [Source: The Concise Dictionary of Crime and Justice; Voice Stress Analysis]
broader: forensics

forensics
type: Concept
narrower: voice stress analysis