concepts
type: Collection
type: ConceptGroup
member: waiting time

waiting time
type: Concept
definition: Waiting time is the time between an expectation for service and the beginning of the service delivery. It occurs when a request for service cannot be satisfied immediately due to a server being occupied with other requests or due to a server being temporarily out of service. [Source: Encyclopedia of Health Care Management; Waiting Time]
broader: operations and decision making

operations and decision making
type: Concept
narrower: waiting time