wargaming
type: Concept
definition: Wargames, or conflict simulations, are games that recreate historical and hypothetical wars, campaigns, and battles. Military and government personnel play wargames to practice skills, rehearse for real conflicts and crises, and explore the impact of new technology and weapons. [Source: Encyclopedia of War & American Society; Wargaming]
broader: war in American culture

war in American culture
type: Concept
narrower: wargaming

concepts
type: Collection
type: ConceptGroup
member: wargaming