waste facility siting
type: Concept
definition: Those trying to license and build hazardous waste facilities often fear what they call “not in my backyard” or NIMBY responses in communities that are targeted for such developments, although land use planner Frank Popper has argued that such reactions are inescapable when dealing with “locally undesirable land uses,” or LULUs. The mere identification of potential sites for hazardous facilities can ignite battles between residents concerned about associated threats and those who focus on opportunities. [Source: Encyclopedia of Community: From the Village to the Virtual World; Waste Facility Siting]
broader: economic concepts

economic concepts
type: Concept
narrower: waste facility siting

concepts
type: Collection
type: ConceptGroup
member: waste facility siting