work-bound youth
type: Concept
definition: The majority of youth enter the world of work prior to receiving postsecondary education or training. By age 26, 85% of youth receive a high school diploma; however, only 27% receive a 4-year college degree. [Source: Encyclopedia of Counseling; Work-Bound Youth]
broader: economic/work issues

economic/work issues
type: Concept
narrower: work-bound youth

concepts
type: Collection
type: ConceptGroup
member: work-bound youth