assessment
type: Concept
narrower: written language assessment

concepts
type: Collection
type: ConceptGroup
member: written language assessment

written language assessment
type: Concept
definition: Writing is the expression of ideas and feelings through the use of written symbols. Over the years, the rapid integration of technology into home and school environments has challenged traditional definitions of writing. [Source: Encyclopedia of School Psychology; Written Language Assessment]
broader: assessment