Alasdair Macintyre
definition: Alasdair MacIntyre (1929–) is a Scottish philosopher with a long and distinguished record of publishing within philosophy. His most renowned work is After Virtue, which was first published in 1981. [Source: Encyclopedia of Criminal Justice Ethics; MacIntyre, Alasdair]
broader: theories of ethics
type: Concept

theories of ethics
type: Concept
narrower: Alasdair Macintyre

people
type: Collection
type: ConceptGroup
member: Alasdair Macintyre