key people in human development
type: Concept
narrower: Alfred Binet

Alfred Binet
definition: Alfred Binet was a French pioneer of modern psychological testing who developed the prototype of many intelligence tests in use today, including the Stanford-Binet Intelligence Scale. Binet was born in 1857, the only child of a physician father and artist mother. [Source: Encyclopedia of Human Development; Binet, Alfred (1857–1911)]
broader: key people in human development
type: Concept

people
type: Collection
type: ConceptGroup
member: Alfred Binet