organizations and associations
type: Concept
narrower: American Association of Orthodontists

organizations
type: Collection
type: ConceptGroup
member: American Association of Orthodontists

American Association of Orthodontists
definition: The American Association of Orthodontists (AAO) was founded in 1901 in St. Louis, Missouri. [Source: Encyclopedia of Global Health; American Association of Orthodontists (AAO)]
broader: organizations and associations
type: Concept