staff
type: Concept
narrower: American Correctional Association

organizations
type: Collection
type: ConceptGroup
member: American Correctional Association

American Correctional Association
definition: The American Correctional Association (ACA) is the official organization devoted to overseeing the development and implementation of improved correctional methods and operational standards. It has more than 20,000 members globally. [Source: Encyclopedia of Prisons & Correctional Facilities; American Correctional Association]
broader: staff
type: Concept