organizations, schools, and projects
type: Concept
narrower: American Educational Research Association

American Educational Research Association
definition: The American Educational Research Association (AERA) is an international professional organization based in Washington, D.C., and dedicated to promoting research in the field of education. Through conferences, publications, and awards, AERA encourages the scientific pursuit and dissemination of knowledge in the educational arena. [Source: Encyclopedia of Research Design; American Educational Research Association]
broader: organizations, schools, and projects
type: Concept

organizations
type: Collection
type: ConceptGroup
member: American Educational Research Association