organizations and associations
type: Concept
narrower: American Fertility Association

organizations
type: Collection
type: ConceptGroup
member: American Fertility Association

American Fertility Association
definition: Sexual behavior is innately directed toward reproduction, however else it may manifest itself. But the ability to reproduce depends on fertility. [Source: Encyclopedia of Sexual Behavior and the Law; American Fertility Association]
broader: organizations and associations
type: Concept