Ancient Rome
definition: Ancient Rome presented a model for how affluence affected play communally and individually over time. Play—sedentary and active, indoor and outdoor, solitary and social—was woven throughout life in ancient Rome. [Source: Encyclopedia of Play in Today's Society; Ancient Rome]
broader: archaeology
type: Concept

archaeology
type: Concept
narrower: Ancient Rome

concepts
type: Collection
type: ConceptGroup
member: Ancient Rome