Arctic Ocean
definition: THE ARCTIC OCEAN is one of the Earth's environments that will be most affected by climate change. As the Earth continues to warm, the Arctic Ocean will evolve into an environment that is much different from what is recognized today. [Source: Encyclopedia of Global Warming and Climate Change; Arctic Ocean]
broader: oceanography
type: Concept

oceanography
type: Concept
narrower: Arctic Ocean

concepts
type: Collection
type: ConceptGroup
member: Arctic Ocean