Southeastern United States
type: Concept
narrower: Arkansas

concepts
type: Collection
type: ConceptGroup
member: Arkansas

Arkansas
definition: Arkansas' marriage and divorce rates are among the highest in the country. According to the U.S. [Source: Cultural Sociology of Divorce: An Encyclopedia; Arkansas]
broader: Southeastern United States
type: Concept