international finance
type: Concept
narrower: BSE Sensex Index

concepts
type: Collection
type: ConceptGroup
member: BSE Sensex Index

BSE Sensex Index
definition: The BSE Sensitive Index (Sensex) is a value-weighted index tracking the performance of 30 stocks on the Bombay Stock Exchange (BSE). The Bombay Stock Exchange was established in 1875, and in the 21st century it lists more stocks (4,700) than any other exchange in the world. [Source: Encyclopedia of Business in Today's World; BSE Sensex Index (Bombay Stock Exchange)]
broader: international finance
type: Concept