Barbara Bush
definition: Barbara Pierce Bush was born in New York City, New York, on June 8, 1925, to Pauline Robinson Pierce and Marvin Pierce. Barbara was third of four children—one sister and two brothers. [Source: Encyclopedia of Motherhood; Bush, Barbara]
broader: prominent mothers
type: Concept

prominent mothers
type: Concept
narrower: Barbara Bush

people
type: Collection
type: ConceptGroup
member: Barbara Bush