key people in anthropology
type: Concept
narrower: Barbara Harrisson

Barbara Harrisson
definition: Barbara Harrisson is an art historian, archaeologist, and naturalist renowned for her work on primate conservation and the prehistory of Borneo. Born into a German family in Silesia, Poland, her early academic studies were interrupted by the events of World War II. From 1953 to1972, she conducted research in Borneo, mostly in collaboration with her husband, Tom Harrisson, curator of the Sarawak Museum. [Source: Encyclopedia of Anthropology; Harrisson, Barbara (1922–)]
broader: key people in anthropology
type: Concept

people
type: Collection
type: ConceptGroup
member: Barbara Harrisson