Calvin Coolidge
definition: Calvin Coolidge, Jr., (1872–1933) was the 30th president of the United States (1923–29). He held various local, state, and federal political posts prior to becoming president. [Source: The Social History of Crime and Punishment in America: An Encylopedia; Coolidge, Calvin (Administration of)]
broader: key people in white-collar and corporate crime
type: Concept

people
type: Collection
type: ConceptGroup
member: Calvin Coolidge

key people in white-collar and corporate crime
type: Concept
narrower: Calvin Coolidge