regionalism
type: Concept
narrower: Caribbean governance

concepts
type: Collection
type: ConceptGroup
member: Caribbean governance

Caribbean governance
definition: The term Caribbean governance relates to the formal and informal ways in which Caribbean states have sought to respond to the changing nature of the regional and global order. The Caribbean region consists of twenty-three small, independent islands, dependent territories, and sovereign states. [Source: Encyclopedia of Governance; Caribbean Governance]
broader: regionalism
type: Concept