race riots
type: Concept
narrower: Chicago Race Riot

events
type: Collection
type: ConceptGroup
member: Chicago Race Riot

Chicago Race Riot
definition: The Chicago Race Riot of 1919 occurred during the “Red Summer,” a 6-month period when race riots occurred in 25 cities in the United States. This entry describes the Chicago Race Riot, which was one of the most violent and deadly during that time. [Source: Encyclopedia of Race and Crime; Chicago Race Riot of 1919]
end: 1919
start: 1919
date: 1919
broader: race riots
type: Concept