Chinese harmony theory
definition: Harmony is the cardinal value of Chinese culture. Chinese believe that the universe is in a process of constant change and transformation caused by the dialectical and dialogical interaction between yin and yang, the two opposite but complementary forces; harmony is the key to bringing continuity into this cycle of transformation. [Source: Encyclopedia of Communication Theory; Chinese Harmony Theory]
broader: cultural orientations
type: Concept

cultural orientations
type: Concept
narrower: Chinese harmony theory

concepts
type: Collection
type: ConceptGroup
member: Chinese harmony theory