community-based housing
type: Concept
narrower: Community Development Block Grant

Community Development Block Grant
definition: The Community Development Block Grant (CDBG) program, created through the Housing & Community Development Act of 1974, is one of the longest running community revitalization programs in the United States. Its passage represented an important shift in federal community development funding by turning eight competitive, categorical grants targeted to specific projects into a single block grant allocated by formula to states and eligible local jurisdictions to fund a broad range of activities. [Source: The Encyclopedia of Housing; Community Development Block Grant]
broader: community-based housing
type: Concept

concepts
type: Collection
type: ConceptGroup
member: Community Development Block Grant