Comprehensive Thrift Act
definition: The Comprehensive Thrift Act, or the Comprehensive Thrift and Bank Fraud Prosecution and Taxpayer Recovery Act of 1990, is Title XXV of the Crimes Control Act of 1990. The purpose of the act is to strengthen the penalties for committing fraud in the financial sector. [Source: Encyclopedia of White-Collar and Corporate Crime; Comprehensive Thrift Act]
broader: banking law
type: Concept

laws
type: Collection
type: ConceptGroup
member: Comprehensive Thrift Act

banking law
type: Concept
narrower: Comprehensive Thrift Act