Connecticut
definition: Connecticut is a small, 5,543-square-mile state in the northeastern United States with a population of about 3.4 million. The population is 79.9 percent white, 9.4 percent African American, and 3.4 percent Asian American. [Source: Cultural Sociology of Divorce: An Encyclopedia; Connecticut]
broader: New England
type: Concept

New England
type: Concept
narrower: Connecticut

concepts
type: Collection
type: ConceptGroup
member: Connecticut