key people in anthropology
type: Concept
narrower: Daniel G. Bates

Daniel G. Bates
definition: Daniel G. Bates champions significant contributions in the study of human ecology. Human ecology links the disciplines of anthropology, biology, geography, demography, and economics in a distinctive theoretical model. [Source: Encyclopedia of Anthropology; Bates, Daniel G.]
broader: key people in anthropology
type: Concept

people
type: Collection
type: ConceptGroup
member: Daniel G. Bates