key people in counseling
type: Concept
narrower: David J. Weiss

people
type: Collection
type: ConceptGroup
member: David J. Weiss

David J. Weiss
definition: David J. Weiss is widely recognized as one of the founders of computerized adaptive testing (CAT) and for directing the development of instruments to assess work adjustment. He earned his B.A. in psychology from the University of Pennsylvania in 1959 and his Ph.D. from the University of Minnesota in 1963. [Source: Encyclopedia of Counseling; Weiss, David J. (1936-)]
broader: key people in counseling
type: Concept